Reaction Details
TargetAurora kinase A
LigandBDBM50335611
Substrate/Competitorn/a
Meas. Tech.ChEMBL_715420 (CHEMBL1664805)
IC50 10±n/a nM
Citation Lan, PChen, WNChen, WM Molecular modeling studies on imidazo[4,5-b]pyridine derivatives as Aurora A kinase inhibitors using 3D-QSAR and docking approaches. Eur J Med Chem46:77-94 (2010) 
 
Aurora kinase A
Name:Aurora kinase A
Type:Serine/threonine-protein kinase
Mol. Mass.:45830.98
Organism:Homo sapiens (Human)
Description:O14965
Residue:403
BDBM50335611
NameBDBM50335611
Synonyms:3-((4-(2-(4-((1H-pyrazol-1-yl)methyl)phenyl)-6-bromo-3H-imidazo[4,5-b]pyridin-7-yl)piperazin-1-yl)methyl)-5-methylisoxazole | CHEMBL1651457
TypeSmall organic molecule
Emp. Form.C25H25BrN8O
Mol. Mass.533.423
SMILESCc1cc(CN2CCN(CC2)c2c(Br)cnc3nc([nH]c23)-c2ccc(Cn3cccn3)cc2)no1