Reaction Details
TargetAurora kinase A
LigandBDBM50224743
Substrate/Competitorn/a
Meas. Tech.ChEMBL_715420 (CHEMBL1664805)
IC50 16000±n/a nM
Citation Lan, PChen, WNChen, WM Molecular modeling studies on imidazo[4,5-b]pyridine derivatives as Aurora A kinase inhibitors using 3D-QSAR and docking approaches. Eur J Med Chem46:77-94 (2010) 
 
Aurora kinase A
Name:Aurora kinase A
Type:Serine/threonine-protein kinase
Mol. Mass.:45830.98
Organism:Homo sapiens (Human)
Description:O14965
Residue:403
BDBM50224743
NameBDBM50224743
Synonyms:2-(3-methoxyphenyl)-3H-imidazo[4,5-b]pyridine | CHEMBL235452
TypeSmall organic molecule
Emp. Form.C13H11N3O
Mol. Mass.225.2459
SMILESCOc1cccc(c1)-c1nc2ncccc2[nH]1