Reaction Details
TargetAurora kinase A
LigandBDBM50335613
Substrate/Competitorn/a
Meas. Tech.ChEMBL_715420 (CHEMBL1664805)
IC50 4400±n/a nM
Citation Lan, PChen, WNChen, WM Molecular modeling studies on imidazo[4,5-b]pyridine derivatives as Aurora A kinase inhibitors using 3D-QSAR and docking approaches. Eur J Med Chem46:77-94 (2010) 
 
Aurora kinase A
Name:Aurora kinase A
Type:Serine/threonine-protein kinase
Mol. Mass.:45830.98
Organism:Homo sapiens (Human)
Description:O14965
Residue:403
BDBM50335613
NameBDBM50335613
Synonyms:2-(4-(pyridin-2-yl)phenyl)-3H-imidazo[4,5-b]pyridine | CHEMBL1651459
TypeSmall organic molecule
Emp. Form.C17H12N4
Mol. Mass.272.304
SMILESc1ccc(nc1)-c1ccc(cc1)-c1nc2ncccc2[nH]1