Reaction Details
TargetAurora kinase A
LigandBDBM50224737
Substrate/Competitorn/a
Meas. Tech.ChEMBL_715420 (CHEMBL1664805)
IC50 6900±n/a nM
Citation Lan, PChen, WNChen, WM Molecular modeling studies on imidazo[4,5-b]pyridine derivatives as Aurora A kinase inhibitors using 3D-QSAR and docking approaches. Eur J Med Chem46:77-94 (2010) 
 
Aurora kinase A
Name:Aurora kinase A
Type:Serine/threonine-protein kinase
Mol. Mass.:45830.98
Organism:Homo sapiens (Human)
Description:O14965
Residue:403
BDBM50224737
NameBDBM50224737
Synonyms:CHEMBL237145 | N,N-dimethyl-4-(6-methyl-3H-imidazo[4,5-b]pyridin-2-yl)benzenamine
TypeSmall organic molecule
Emp. Form.C15H16N4
Mol. Mass.252.3143
SMILESCN(C)c1ccc(cc1)-c1nc2ncc(C)cc2[nH]1