Reaction Details
TargetAurora kinase A
LigandBDBM50318577
Substrate/Competitorn/a
Meas. Tech.ChEMBL_715420 (CHEMBL1664805)
IC50 115±n/a nM
Citation Lan, PChen, WNChen, WM Molecular modeling studies on imidazo[4,5-b]pyridine derivatives as Aurora A kinase inhibitors using 3D-QSAR and docking approaches. Eur J Med Chem46:77-94 (2010) 
 
Aurora kinase A
Name:Aurora kinase A
Type:Serine/threonine-protein kinase
Mol. Mass.:45830.98
Organism:Homo sapiens (Human)
Description:O14965
Residue:403
BDBM50318577
NameBDBM50318577
Synonyms:2-(4-(6-Chloro-2-(4-(dimethylamino)phenyl)-3H-imidazo[4,5-b]-pyridin-7-yl)piperazin-1-yl)-N-phenylacetamide | CHEMBL1083771
TypeSmall organic molecule
Emp. Form.C26H28ClN7O
Mol. Mass.490
SMILESCN(C)c1ccc(cc1)-c1nc2ncc(Cl)c(N3CCN(CC(=O)Nc4ccccc4)CC3)c2[nH]1