Reaction Details
TargetAurora kinase A
LigandBDBM50318592
Substrate/Competitorn/a
Meas. Tech.ChEMBL_715420 (CHEMBL1664805)
IC50 12±n/a nM
Citation Lan, PChen, WNChen, WM Molecular modeling studies on imidazo[4,5-b]pyridine derivatives as Aurora A kinase inhibitors using 3D-QSAR and docking approaches. Eur J Med Chem46:77-94 (2010) 
 
Aurora kinase A
Name:Aurora kinase A
Type:Serine/threonine-protein kinase
Mol. Mass.:45830.98
Organism:Homo sapiens (Human)
Description:O14965
Residue:403
BDBM50318592
NameBDBM50318592
Synonyms:6-BROMO-7-[4-(4-CHLOROBENZYL)PIPERAZIN-1-YL]-2-[4-(MORPHOLIN-4-YLMETHYL)PHENYL]-3H-IMIDAZO[4,5-B]PYRIDINE CHEMBL1083772
TypeSmall organic molecule
Emp. Form.C28H30BrClN6O
Mol. Mass.581.934
SMILESClc1ccc(CN2CCN(CC2)c2c(Br)cnc3nc([nH]c23)-c2ccc(CN3CCOCC3)cc2)cc1