Reaction Details
TargetAurora kinase A
LigandBDBM50318595
Substrate/Competitorn/a
Meas. Tech.ChEMBL_715420 (CHEMBL1664805)
IC50 2±n/a nM
Citation Lan, PChen, WNChen, WM Molecular modeling studies on imidazo[4,5-b]pyridine derivatives as Aurora A kinase inhibitors using 3D-QSAR and docking approaches. Eur J Med Chem46:77-94 (2010) 
 
Aurora kinase A
Name:Aurora kinase A
Type:Serine/threonine-protein kinase
Mol. Mass.:45830.98
Organism:Homo sapiens (Human)
Description:O14965
Residue:403
BDBM50318595
NameBDBM50318595
Synonyms:6-Bromo-7-[4-(5-methyl-isoxazol-3-ylmethyl)-piperazin-1-yl]-2-(4-morpholin-4-ylmethyl-phenyl)-3H-imidazo[4,5-b]pyridine | CHEMBL1084079
TypeSmall organic molecule
Emp. Form.C26H30BrN7O2
Mol. Mass.552.466
SMILESCc1cc(CN2CCN(CC2)c2c(Br)cnc3nc([nH]c23)-c2ccc(CN3CCOCC3)cc2)no1