Reaction Details
TargetSerine/threonine-protein kinase Chk2
LigandBDBM50335680
Substrate/Competitorn/a
Meas. Tech.ChEMBL_714871 (CHEMBL1663817)
IC50 12±n/a nM
Citation Caldwell, JJWelsh, EJMatijssen, CAnderson, VEAntoni, LBoxall, KUrban, FHayes, ARaynaud, FIRigoreau, LJRaynham, TAherne, GWPearl, LHOliver, AWGarrett, MDCollins, I Structure-based design of potent and selective 2-(quinazolin-2-yl)phenol inhibitors of checkpoint kinase 2. J Med Chem54:580-90 (2011) 
 
Serine/threonine-protein kinase Chk2
Name:Serine/threonine-protein kinase Chk2
Type:Protein
Mol. Mass.:60908.59
Organism:Homo sapiens (Human)
Description:O96017
Residue:543
BDBM50335680
NameBDBM50335680
Synonyms:(S)-2-(6,7-dimethoxy-4-(pyrrolidin-3-ylamino)quinazolin-2-yl)-4-fluorophenol | CHEMBL1650125
TypeSmall organic molecule
Emp. Form.C20H21FN4O3
Mol. Mass.384.4041
SMILESCOc1cc2nc(nc(N[C@H]3CCNC3)c2cc1OC)-c1cc(F)ccc1O