Reaction Details
TargetSerine/threonine-protein kinase Chk2
LigandBDBM50335683
Substrate/Competitorn/a
Meas. Tech.ChEMBL_714871 (CHEMBL1663817)
IC50 5±n/a nM
Citation Caldwell, JJWelsh, EJMatijssen, CAnderson, VEAntoni, LBoxall, KUrban, FHayes, ARaynaud, FIRigoreau, LJRaynham, TAherne, GWPearl, LHOliver, AWGarrett, MDCollins, I Structure-based design of potent and selective 2-(quinazolin-2-yl)phenol inhibitors of checkpoint kinase 2. J Med Chem54:580-90 (2011) 
 
Serine/threonine-protein kinase Chk2
Name:Serine/threonine-protein kinase Chk2
Type:Protein
Mol. Mass.:60908.59
Organism:Homo sapiens (Human)
Description:O96017
Residue:543
BDBM50335683
NameBDBM50335683
Synonyms:4-fluoro-2-(4-((3S,4R)-4-(2-hydroxypropan-2-yl)pyrrolidin-3-ylamino)-6-methoxy-7-(2-methoxyethoxy)quinazolin-2-yl)phenol | CHEMBL1650128
TypeSmall organic molecule
Emp. Form.C25H31FN4O5
Mol. Mass.486.5358
SMILESCOCCOc1cc2nc(nc(N[C@@H]3CNC[C@H]3C(C)(C)O)c2cc1OC)-c1cc(F)ccc1O