Reaction Details
TargetAdenosine receptor A3
LigandBDBM50335707
Substrate/Competitorn/a
Meas. Tech.ChEMBL_715074 (CHEMBL1664180)
Ki 4.4±n/a nM
Citation Yaziji, VRodríguez, DGutiérrez-de-Terán, HCoelho, ACaamaño, OGarcía-Mera, XBrea, JLoza, MICadavid, MISotelo, E Pyrimidine derivatives as potent and selective A3 adenosine receptor antagonists. J Med Chem54:457-71 (2011) 
 
Adenosine receptor A3
Name:Adenosine receptor A3
Type:G Protein-Coupled Receptor (GPCR)
Mol. Mass.:36197.32
Organism:Homo sapiens (Human)
Description:P0DMS8
Residue:318
BDBM50335707
NameBDBM50335707
Synonyms:CHEMBL1650349 | N-2,6-di-p-tolylpyrimidin-4-yl)acetamide
TypeSmall organic molecule
Emp. Form.C20H19N3O
Mol. Mass.317.3844
SMILESCC(=O)Nc1cc(nc(n1)-c1ccc(C)cc1)-c1ccc(C)cc1