Reaction Details
TargetAdenosine receptor A3
LigandBDBM50335732
Substrate/Competitorn/a
Meas. Tech.ChEMBL_715074 (CHEMBL1664180)
Ki 11.3±n/a nM
Citation Yaziji, VRodríguez, DGutiérrez-de-Terán, HCoelho, ACaamaño, OGarcía-Mera, XBrea, JLoza, MICadavid, MISotelo, E Pyrimidine derivatives as potent and selective A3 adenosine receptor antagonists. J Med Chem54:457-71 (2011) 
 
Adenosine receptor A3
Name:Adenosine receptor A3
Type:G Protein-Coupled Receptor (GPCR)
Mol. Mass.:36197.32
Organism:Homo sapiens (Human)
Description:P0DMS8
Residue:318
BDBM50335732
NameBDBM50335732
Synonyms:CHEMBL1650377 | N-2,6-bis2,4-dimethoxyphenyl)pyrimidin-4-yl)propionamide
TypeSmall organic molecule
Emp. Form.C23H25N3O5
Mol. Mass.423.4617
SMILESCCC(=O)Nc1cc(nc(n1)-c1ccc(OC)cc1OC)-c1ccc(OC)cc1OC