Reaction Details
TargetAdenosine receptor A3
LigandBDBM50335733
Substrate/Competitorn/a
Meas. Tech.ChEMBL_715074 (CHEMBL1664180)
Ki 10.2±n/a nM
Citation Yaziji, VRodríguez, DGutiérrez-de-Terán, HCoelho, ACaamaño, OGarcía-Mera, XBrea, JLoza, MICadavid, MISotelo, E Pyrimidine derivatives as potent and selective A3 adenosine receptor antagonists. J Med Chem54:457-71 (2011) 
 
Adenosine receptor A3
Name:Adenosine receptor A3
Type:G Protein-Coupled Receptor (GPCR)
Mol. Mass.:36197.32
Organism:Homo sapiens (Human)
Description:P0DMS8
Residue:318
BDBM50335733
NameBDBM50335733
Synonyms:CHEMBL1650378 | N-2,6-bis2,4-dimethoxyphenyl)pyrimidin-4-yl)butyramide
TypeSmall organic molecule
Emp. Form.C24H27N3O5
Mol. Mass.437.4883
SMILESCCCC(=O)Nc1cc(nc(n1)-c1ccc(OC)cc1OC)-c1ccc(OC)cc1OC