Reaction Details
TargetAdenosine receptor A3
LigandBDBM50335697
Substrate/Competitorn/a
Meas. Tech.ChEMBL_715074 (CHEMBL1664180)
Ki 10.1±n/a nM
Citation Yaziji, VRodríguez, DGutiérrez-de-Terán, HCoelho, ACaamaño, OGarcía-Mera, XBrea, JLoza, MICadavid, MISotelo, E Pyrimidine derivatives as potent and selective A3 adenosine receptor antagonists. J Med Chem54:457-71 (2011) 
 
Adenosine receptor A3
Name:Adenosine receptor A3
Type:G Protein-Coupled Receptor (GPCR)
Mol. Mass.:36197.32
Organism:Homo sapiens (Human)
Description:P0DMS8
Residue:318
BDBM50335697
NameBDBM50335697
Synonyms:CHEMBL1650390 | N-2,6-difuran-3-yl)pyrimidin-4-yl)acetamide
TypeSmall organic molecule
Emp. Form.C14H11N3O3
Mol. Mass.269.2554
SMILESCC(=O)Nc1cc(nc(n1)-c1ccoc1)-c1ccoc1