Reaction Details
TargetAdenosine receptor A1
LigandBDBM50157673
Substrate/Competitorn/a
Meas. Tech.ChEMBL_715069 (CHEMBL1664119)
Ki 3.7±n/a nM
Citation Yaziji, VRodríguez, DGutiérrez-de-Terán, HCoelho, ACaamaño, OGarcía-Mera, XBrea, JLoza, MICadavid, MISotelo, E Pyrimidine derivatives as potent and selective A3 adenosine receptor antagonists. J Med Chem54:457-71 (2011) 
 
Adenosine receptor A1
Name:Adenosine receptor A1
Type:G Protein-Coupled Receptor (GPCR)
Mol. Mass.:36520.92
Organism:Homo sapiens (Human)
Description:P30542
Residue:326
BDBM50157673
NameBDBM50157673
Synonyms:CHEMBL222719 N-(4,6-diphenylpyrimidin-2-yl)butyramide
TypeSmall organic molecule
Emp. Form.C20H19N3O
Mol. Mass.317.3844
SMILESCCCC(=O)Nc1nc(cc(n1)-c1ccccc1)-c1ccccc1