Reaction Details
TargetAdenosine receptor A1
LigandBDBM50335696
Substrate/Competitorn/a
Meas. Tech.ChEMBL_715069 (CHEMBL1664119)
Ki 7.8±n/a nM
Citation Yaziji, VRodríguez, DGutiérrez-de-Terán, HCoelho, ACaamaño, OGarcía-Mera, XBrea, JLoza, MICadavid, MISotelo, E Pyrimidine derivatives as potent and selective A3 adenosine receptor antagonists. J Med Chem54:457-71 (2011) 
 
Adenosine receptor A1
Name:Adenosine receptor A1
Type:G Protein-Coupled Receptor (GPCR)
Mol. Mass.:36520.92
Organism:Homo sapiens (Human)
Description:P30542
Residue:326
BDBM50335696
NameBDBM50335696
Synonyms:CHEMBL1650386 | N-2,6-difuran-2-yl)pyrimidin-4-yl)butyramide
TypeSmall organic molecule
Emp. Form.C16H15N3O3
Mol. Mass.297.3086
SMILESCCCC(=O)Nc1cc(nc(n1)-c1ccco1)-c1ccco1