Reaction Details
TargetAdenosine receptor A2a
LigandBDBM50335694
Substrate/Competitorn/a
Meas. Tech.ChEMBL_715071 (CHEMBL1664177)
Ki 8.1±n/a nM
Citation Yaziji, VRodríguez, DGutiérrez-de-Terán, HCoelho, ACaamaño, OGarcía-Mera, XBrea, JLoza, MICadavid, MISotelo, E Pyrimidine derivatives as potent and selective A3 adenosine receptor antagonists. J Med Chem54:457-71 (2011) 
 
Adenosine receptor A2a
Name:Adenosine receptor A2a
Type:G Protein-Coupled Receptor (GPCR)
Mol. Mass.:44716.46
Organism:Homo sapiens (Human)
Description:P29274
Residue:412
BDBM50335694
NameBDBM50335694
Synonyms:CHEMBL1650384 | N-2,6-difuran-2-yl)pyrimidin-4-yl)acetamide
TypeSmall organic molecule
Emp. Form.C14H11N3O3
Mol. Mass.269.2554
SMILESCC(=O)Nc1cc(nc(n1)-c1ccco1)-c1ccco1