Reaction Details
TargetCytochrome P450 2D6
LigandBDBM50121975
Substrate/Competitorn/a
Meas. Tech.ChEMBL_715319 (CHEMBL1664606)
IC50 10.0±n/a nM
Citation Marchais-Oberwinkler, SWetzel, MZiegler, EKruchten, PWerth, RHenn, CHartmann, RWFrotscher, M New drug-like hydroxyphenylnaphthol steroidomimetics as potent and selective 17ß-hydroxysteroid dehydrogenase type 1 inhibitors for the treatment of estrogen-dependent diseases. J Med Chem54:534-47 (2011) 
 
Cytochrome P450 2D6
Name:Cytochrome P450 2D6
Type:Protein
Mol. Mass.:55774.82
Organism:Homo sapiens (Human)
Description:P10635
Residue:497
BDBM50121975
NameBDBM50121975
Synonyms:(6-Methoxy-quinolin-4-yl)-(5-vinyl-1-aza-bicyclo[2.2.2]oct-2-yl)-methanol CHEMBL1294 DURAQUIN QUINAGLUTE QUINATIME QUINIDINE US9402878, Quinidine
TypeSmall organic molecule
Emp. Form.C20H24N2O2
Mol. Mass.324.4168
SMILESCOc1ccc2nccc([C@H](O)[C@H]3C[C@@H]4CCN3C[C@@H]4C=C)c2c1