Reaction Details
TargetCannabinoid receptor 2
LigandBDBM50324636
Substrate/Competitorn/a
Meas. Tech.ChEMBL_717853 (CHEMBL1670561)
Ki 4.2±n/a nM
Citation Brogi, SCorelli, FDi Marzo, VLigresti, AMugnaini, CPasquini, STafi, A Three-dimensional quantitative structure-selectivity relationships analysis guided rational design of a highly selective ligand for the cannabinoid receptor 2. Eur J Med Chem46:547-55 (2011) 
 
Cannabinoid receptor 2
Name:Cannabinoid receptor 2
Type:G Protein-Coupled Receptor (GPCR)
Mol. Mass.:39690.94
Organism:Homo sapiens (Human)
Description:P34972
Residue:360
BDBM50324636
NameBDBM50324636
Synonyms:6-(4-Hydroxy-phenyl)-4-oxo-1-pentyl-1,4-dihydro-quinoline-3-carboxylicacid adamantan-1-ylamide | CHEMBL1215918
TypeSmall organic molecule
Emp. Form.C31H36N2O3
Mol. Mass.484.6291
SMILESCCCCCn1cc(C(=O)NC23CC4CC(CC(C4)C2)C3)c(=O)c2cc(ccc12)-c1ccc(O)cc1