Reaction Details
TargetCannabinoid receptor 2
LigandBDBM50063884
Substrate/Competitorn/a
Meas. Tech.ChEMBL_717853 (CHEMBL1670561)
Ki 0.9±n/a nM
Citation Brogi, SCorelli, FDi Marzo, VLigresti, AMugnaini, CPasquini, STafi, A Three-dimensional quantitative structure-selectivity relationships analysis guided rational design of a highly selective ligand for the cannabinoid receptor 2. Eur J Med Chem46:547-55 (2011) 
 
Cannabinoid receptor 2
Name:Cannabinoid receptor 2
Type:G Protein-Coupled Receptor (GPCR)
Mol. Mass.:39690.94
Organism:Homo sapiens (Human)
Description:P34972
Residue:360
BDBM50063884
NameBDBM50063884
Synonyms:(6aR,10aR)-3-(1-Hexyl-cyclopropyl)-6,6,9-trimethyl-6a,7,10,10a-tetrahydro-6H-benzo[c]chromen-1-ol CHEMBL19847
TypeSmall organic molecule
Emp. Form.C25H36O2
Mol. Mass.368.5521
SMILESCCCCCCC1(CC1)c1cc(O)c2[C@@H]3CC(C)=CC[C@H]3C(C)(C)Oc2c1