Reaction Details
TargetCannabinoid receptor 2
LigandBDBM50277154
Substrate/Competitorn/a
Meas. Tech.ChEMBL_717853 (CHEMBL1670561)
Ki 11±n/a nM
Citation Brogi, SCorelli, FDi Marzo, VLigresti, AMugnaini, CPasquini, STafi, A Three-dimensional quantitative structure-selectivity relationships analysis guided rational design of a highly selective ligand for the cannabinoid receptor 2. Eur J Med Chem46:547-55 (2011) 
 
Cannabinoid receptor 2
Name:Cannabinoid receptor 2
Type:G Protein-Coupled Receptor (GPCR)
Mol. Mass.:39690.94
Organism:Homo sapiens (Human)
Description:P34972
Residue:360
BDBM50277154
NameBDBM50277154
Synonyms:2,2-dimethyl-N-(4-methyl-3-(morpholinosulfonyl)phenyl)cyclohexanecarboxamide | CHEMBL474692
TypeSmall organic molecule
Emp. Form.C20H30N2O4S
Mol. Mass.394.528
SMILESCc1ccc(NC(=O)C2CCCCC2(C)C)cc1S(=O)(=O)N1CCOCC1