Reaction Details
TargetCannabinoid receptor 2
LigandBDBM50335946
Substrate/Competitorn/a
Meas. Tech.ChEMBL_717853 (CHEMBL1670561)
Ki 2.7±n/a nM
Citation Brogi, SCorelli, FDi Marzo, VLigresti, AMugnaini, CPasquini, STafi, A Three-dimensional quantitative structure-selectivity relationships analysis guided rational design of a highly selective ligand for the cannabinoid receptor 2. Eur J Med Chem46:547-55 (2011) 
 
Cannabinoid receptor 2
Name:Cannabinoid receptor 2
Type:G Protein-Coupled Receptor (GPCR)
Mol. Mass.:39690.94
Organism:Homo sapiens (Human)
Description:P34972
Residue:360
BDBM50335946
NameBDBM50335946
Synonyms:1-(3,4-dimethyl-5-(piperidin-1-ylsulfonyl)phenyl)-3,3-dimethylpentan-2-one | CHEMBL1668514
TypeSmall organic molecule
Emp. Form.C20H31NO3S
Mol. Mass.365.53
SMILESCCC(C)(C)C(=O)Cc1cc(C)c(C)c(c1)S(=O)(=O)N1CCCCC1