Reaction Details
TargetCannabinoid receptor 2
LigandBDBM50244360
Substrate/Competitorn/a
Meas. Tech.ChEMBL_717853 (CHEMBL1670561)
Ki 0.91±n/a nM
Citation Brogi, SCorelli, FDi Marzo, VLigresti, AMugnaini, CPasquini, STafi, A Three-dimensional quantitative structure-selectivity relationships analysis guided rational design of a highly selective ligand for the cannabinoid receptor 2. Eur J Med Chem46:547-55 (2011) 
 
Cannabinoid receptor 2
Name:Cannabinoid receptor 2
Type:G Protein-Coupled Receptor (GPCR)
Mol. Mass.:39690.94
Organism:Homo sapiens (Human)
Description:P34972
Residue:360
BDBM50244360
NameBDBM50244360
Synonyms:(6aR,10aR)-6,6,9-trimethyl-3-(2-(thiophen-2-yl)propan-2-yl)-6a,7,10,10a-tetrahydro-6H-benzo[c]chromen-1-ol CHEMBL519575
TypeSmall organic molecule
Emp. Form.C23H28O2S
Mol. Mass.368.532
SMILESCC1=CC[C@@H]2[C@@H](C1)c1c(O)cc(cc1OC2(C)C)C(C)(C)c1cccs1