Reaction Details
TargetCannabinoid receptor 1
LigandBDBM50324635
Substrate/Competitorn/a
Meas. Tech.ChEMBL_717852 (CHEMBL1670560)
Ki>10000±n/a nM
Citation Brogi, SCorelli, FDi Marzo, VLigresti, AMugnaini, CPasquini, STafi, A Three-dimensional quantitative structure-selectivity relationships analysis guided rational design of a highly selective ligand for the cannabinoid receptor 2. Eur J Med Chem46:547-55 (2011) 
 
Cannabinoid receptor 1
Name:Cannabinoid receptor 1
Type:G Protein-Coupled Receptor (GPCR)
Mol. Mass.:52868.96
Organism:Homo sapiens (Human)
Description:P21554
Residue:472
BDBM50324635
NameBDBM50324635
Synonyms:4-Oxo-1-pentyl-6-thiophen-2-yl-1,4-dihydro-quinoline-3-carboxylic acidadamantan-1-ylamide | CHEMBL1215941
TypeSmall organic molecule
Emp. Form.C29H34N2O2S
Mol. Mass.474.657
SMILESCCCCCn1cc(C(=O)NC23CC4CC(CC(C4)C2)C3)c(=O)c2cc(ccc12)-c1cccs1