Reaction Details
TargetCannabinoid receptor 1
LigandBDBM50324653
Substrate/Competitorn/a
Meas. Tech.ChEMBL_717852 (CHEMBL1670560)
Ki>10000±n/a nM
Citation Brogi, SCorelli, FDi Marzo, VLigresti, AMugnaini, CPasquini, STafi, A Three-dimensional quantitative structure-selectivity relationships analysis guided rational design of a highly selective ligand for the cannabinoid receptor 2. Eur J Med Chem46:547-55 (2011) 
 
Cannabinoid receptor 1
Name:Cannabinoid receptor 1
Type:G Protein-Coupled Receptor (GPCR)
Mol. Mass.:52868.96
Organism:Homo sapiens (Human)
Description:P21554
Residue:472
BDBM50324653
NameBDBM50324653
Synonyms:CHEMBL1215963 | N-(Adamantan-1-yl)-6-(1H-imidazol-1-yl)-4-oxo-1-pentyl-1,4-dihydroquinoline-3-carboxamide
TypeSmall organic molecule
Emp. Form.C28H34N4O2
Mol. Mass.458.5952
SMILESCCCCCn1cc(C(=O)NC23CC4CC(CC(C4)C2)C3)c(=O)c2cc(ccc12)-n1ccnc1