Reaction Details
TargetCannabinoid receptor 1
LigandBDBM50121425
Substrate/Competitorn/a
Meas. Tech.ChEMBL_717852 (CHEMBL1670560)
Ki 1.8±n/a nM
Citation Brogi, SCorelli, FDi Marzo, VLigresti, AMugnaini, CPasquini, STafi, A Three-dimensional quantitative structure-selectivity relationships analysis guided rational design of a highly selective ligand for the cannabinoid receptor 2. Eur J Med Chem46:547-55 (2011) 
 
Cannabinoid receptor 1
Name:Cannabinoid receptor 1
Type:G Protein-Coupled Receptor (GPCR)
Mol. Mass.:52868.96
Organism:Homo sapiens (Human)
Description:P21554
Residue:472
BDBM50121425
NameBDBM50121425
Synonyms:(6aR,10aR)-3-(2,2-Dichloro-1-hexyl-cyclopropyl)-6,6,9-trimethyl-6a,7,10,10a-tetrahydro-6H-benzo[c]chromen-1-ol CHEMBL120669
TypeSmall organic molecule
Emp. Form.C25H34Cl2O2
Mol. Mass.437.442
SMILESCCCCCCC1(CC1(Cl)Cl)c1cc(O)c2[C@@H]3CC(C)=CC[C@H]3C(C)(C)Oc2c1