Reaction Details
TargetCannabinoid receptor 1
LigandBDBM50277192
Substrate/Competitorn/a
Meas. Tech.ChEMBL_717852 (CHEMBL1670560)
Ki 390±n/a nM
Citation Brogi, SCorelli, FDi Marzo, VLigresti, AMugnaini, CPasquini, STafi, A Three-dimensional quantitative structure-selectivity relationships analysis guided rational design of a highly selective ligand for the cannabinoid receptor 2. Eur J Med Chem46:547-55 (2011) 
 
Cannabinoid receptor 1
Name:Cannabinoid receptor 1
Type:G Protein-Coupled Receptor (GPCR)
Mol. Mass.:52868.96
Organism:Homo sapiens (Human)
Description:P21554
Residue:472
BDBM50277192
NameBDBM50277192
Synonyms:4-(5-(4-(cyclohexylmethyl)thiazol-2-yl)-2-methylphenylsulfonyl)morpholine | CHEMBL474896
TypeSmall organic molecule
Emp. Form.C21H28N2O3S2
Mol. Mass.420.589
SMILESCc1ccc(cc1S(=O)(=O)N1CCOCC1)-c1nc(CC2CCCCC2)cs1