Reaction Details
TargetCannabinoid receptor 1
LigandBDBM50213605
Substrate/Competitorn/a
Meas. Tech.ChEMBL_717852 (CHEMBL1670560)
Ki 0.94±n/a nM
Citation Brogi, SCorelli, FDi Marzo, VLigresti, AMugnaini, CPasquini, STafi, A Three-dimensional quantitative structure-selectivity relationships analysis guided rational design of a highly selective ligand for the cannabinoid receptor 2. Eur J Med Chem46:547-55 (2011) 
 
Cannabinoid receptor 1
Name:Cannabinoid receptor 1
Type:G Protein-Coupled Receptor (GPCR)
Mol. Mass.:52868.96
Organism:Homo sapiens (Human)
Description:P21554
Residue:472
BDBM50213605
NameBDBM50213605
Synonyms:(6aR,10aR)-3-(2-cycloheptylpropan-2-yl)-6,6,9-trimethyl-6a,7,10,10a-tetrahydro-6H-benzo[c]chromen-1-ol | CHEMBL252949
TypeSmall organic molecule
Emp. Form.C26H38O2
Mol. Mass.382.5787
SMILESCC1=CC[C@@H]2[C@@H](C1)c1c(O)cc(cc1OC2(C)C)C(C)(C)C1CCCCCC1