Reaction Details
TargetCannabinoid receptor 2
LigandBDBM21299
Substrate/Competitorn/a
Meas. Tech.ChEMBL_717853 (CHEMBL1670561)
Ki 4.6±n/a nM
Citation Brogi, SCorelli, FDi Marzo, VLigresti, AMugnaini, CPasquini, STafi, A Three-dimensional quantitative structure-selectivity relationships analysis guided rational design of a highly selective ligand for the cannabinoid receptor 2. Eur J Med Chem46:547-55 (2011) 
 
Cannabinoid receptor 2
Name:Cannabinoid receptor 2
Type:G Protein-Coupled Receptor (GPCR)
Mol. Mass.:39690.94
Organism:Homo sapiens (Human)
Description:P34972
Residue:360
BDBM21299
NameBDBM21299
Synonyms:5-methoxy-1-(oxan-4-ylmethyl)-3-[(2,2,3,3-tetramethylcyclopropyl)carbonyl]-1H-indole | Tetrahydropyranyl-methyl analogue, 20
TypeSmall organic molecule
Emp. Form.C23H31NO3
Mol. Mass.369.4971
SMILESCOc1ccc2n(CC3CCOCC3)cc(C(=O)C3C(C)(C)C3(C)C)c2c1