Reaction Details
TargetCannabinoid receptor 2
LigandBDBM21303
Substrate/Competitorn/a
Meas. Tech.ChEMBL_717853 (CHEMBL1670561)
Ki 1.3±n/a nM
Citation Brogi, SCorelli, FDi Marzo, VLigresti, AMugnaini, CPasquini, STafi, A Three-dimensional quantitative structure-selectivity relationships analysis guided rational design of a highly selective ligand for the cannabinoid receptor 2. Eur J Med Chem46:547-55 (2011) 
 
Cannabinoid receptor 2
Name:Cannabinoid receptor 2
Type:G Protein-Coupled Receptor (GPCR)
Mol. Mass.:39690.94
Organism:Homo sapiens (Human)
Description:P34972
Residue:360
BDBM21303
NameBDBM21303
Synonyms:5-(benzyloxy)-1-(oxan-4-ylmethyl)-3-[(2,2,3,3-tetramethylcyclopropyl)carbonyl]-1H-indole | Tetrahydropyranyl-methyl analogue, 24
TypeSmall organic molecule
Emp. Form.C29H35NO3
Mol. Mass.445.5931
SMILESCC1(C)C(C(=O)c2cn(CC3CCOCC3)c3ccc(OCc4ccccc4)cc23)C1(C)C