Reaction Details
TargetCannabinoid receptor 2
LigandBDBM21282
Substrate/Competitorn/a
Meas. Tech.ChEMBL_717853 (CHEMBL1670561)
Ki 13.3±n/a nM
Citation Brogi, SCorelli, FDi Marzo, VLigresti, AMugnaini, CPasquini, STafi, A Three-dimensional quantitative structure-selectivity relationships analysis guided rational design of a highly selective ligand for the cannabinoid receptor 2. Eur J Med Chem46:547-55 (2011) 
 
Cannabinoid receptor 2
Name:Cannabinoid receptor 2
Type:G Protein-Coupled Receptor (GPCR)
Mol. Mass.:39690.94
Organism:Homo sapiens (Human)
Description:P34972
Residue:360
BDBM21282
NameBDBM21282
Synonyms:2-methyl-3-(naphthalen-1-ylcarbonyl)-1-propyl-1H-indole JWH-015
Typen/a
Emp. Form.C23H21NO
Mol. Mass.327.4189
SMILESCCCn1c(C)c(C(=O)c2cccc3ccccc23)c2ccccc12