Reaction Details
TargetProstaglandin D2 receptor 2
LigandBDBM50335954
Substrate/Competitorn/a
Meas. Tech.ChEMBL_716963 (CHEMBL1670991)
IC50 1.7±n/a nM
Citation Stock, NVolkots, DStebbins, KBroadhead, AStearns, BRoppe, JParr, TBaccei, CBain, GChapman, CCorrea, LDarlington, JKing, CLee, CLorrain, DSProdanovich, PSantini, AEvans, JFHutchinson, JHPrasit, P Sodium [2'-[(cyclopropanecarbonyl-ethyl-amino)-methyl]-4'-(6-ethoxy-pyridin-3-yl)-6-methoxy-biphenyl-3-yl]-acetate (AM432): a potent, selective prostaglandin D2 receptor antagonist. Bioorg Med Chem Lett21:1036-40 (2011) 
 
Prostaglandin D2 receptor 2
Name:Prostaglandin D2 receptor 2
Type:Enzyme
Mol. Mass.:43295.45
Organism:Homo sapiens (Human)
Description:Q9Y5Y4
Residue:395
BDBM50335954
NameBDBM50335954
Synonyms:CHEMBL1668898 | Sodium [2'-[(cyclopropanecarbonyl-ethyl-amino)-methyl]-4'-(6-ethoxy-pyridin-3-yl)-6-methoxy-biphenyl-3-yl]-acetate
TypeSmall organic molecule
Emp. Form.C29H31N2O5
Mol. Mass.487.5674
SMILESCCOc1ccc(cn1)-c1ccc(c(CN(CC)C(=O)C2CC2)c1)-c1cc(CC([O-])=O)ccc1OC