Reaction Details
TargetBifunctional epoxide hydrolase 2
LigandBDBM50335967
Substrate/Competitorn/a
Meas. Tech.ChEMBL_716996 (CHEMBL1671068)
IC50 2.9±n/a nM
Citation Anandan, SKWebb, HKChen, DWang, YXAavula, BRCases, SCheng, YDo, ZNMehra, UTran, VVincelette, JWaszczuk, JWhite, KWong, KRZhang, LNJones, PDHammock, BDPatel, DVWhitcomb, RMacIntyre, DESabry, JGless, R 1-(1-acetyl-piperidin-4-yl)-3-adamantan-1-yl-urea (AR9281) as a potent, selective, and orally available soluble epoxide hydrolase inhibitor with efficacy in rodent models of hypertension and dysglycemia. Bioorg Med Chem Lett21:983-8 (2011) 
 
Bifunctional epoxide hydrolase 2
Name:Bifunctional epoxide hydrolase 2
Type:Enzyme
Mol. Mass.:62613.07
Organism:Homo sapiens (Human)
Description:P34913
Residue:555
BDBM50335967
NameBDBM50335967
Synonyms:1-(1-(isopropylsulfonyl)piperidin-4-yl)-3-(4-(trifluoromethyl)phenyl)urea | CHEMBL1668939
TypeSmall organic molecule
Emp. Form.C16H22F3N3O3S
Mol. Mass.393.424
SMILESCC(C)S(=O)(=O)N1CCC(CC1)NC(=O)Nc1ccc(cc1)C(F)(F)F