Reaction Details
TargetProstaglandin E2 receptor EP4 subtype
LigandBDBM50335994
Substrate/Competitorn/a
Meas. Tech.ChEMBL_717059 (CHEMBL1671177)
Ki 0.49±n/a nM
Citation Burch, JDFarand, JColucci, JSturino, CDucharme, YFriesen, RWLévesque, JFGagné, SWrona, MTherien, AGMathieu, MCDenis, DVigneault, EXu, DClark, PRowland, SHan, Y Naphthalene/quinoline amides and sulfonylureas as potent and selective antagonists of the EP4 receptor. Bioorg Med Chem Lett21:1041-6 (2011) 
 
Prostaglandin E2 receptor EP4 subtype
Name:Prostaglandin E2 receptor EP4 subtype
Type:Enzyme
Mol. Mass.:53134.53
Organism:Homo sapiens (Human)
Description:P35408
Residue:488
BDBM50335994
NameBDBM50335994
Synonyms:2-bromo-N-(1-(4-(4,9-diethoxy-1-oxo-1H-benzo[f]isoindol-2(3H)-yl)-3-methylbenzyl)cyclopropylcarbamoyl)benzenesulfonamide | CHEMBL1669004
TypeSmall organic molecule
Emp. Form.C34H34BrN3O6S
Mol. Mass.692.619
SMILESCCOc1c2CN(C(=O)c2c(OCC)c2ccccc12)c1ccc(CC2(CC2)NC(=O)NS(=O)(=O)c2ccccc2Br)cc1C