Reaction Details
TargetProstaglandin E2 receptor EP4 subtype
LigandBDBM50335995
Substrate/Competitorn/a
Meas. Tech.ChEMBL_717060 (CHEMBL1671178)
Ki 21±n/a nM
Citation Burch, JDFarand, JColucci, JSturino, CDucharme, YFriesen, RWLévesque, JFGagné, SWrona, MTherien, AGMathieu, MCDenis, DVigneault, EXu, DClark, PRowland, SHan, Y Naphthalene/quinoline amides and sulfonylureas as potent and selective antagonists of the EP4 receptor. Bioorg Med Chem Lett21:1041-6 (2011) 
 
Prostaglandin E2 receptor EP4 subtype
Name:Prostaglandin E2 receptor EP4 subtype
Type:Enzyme
Mol. Mass.:53134.53
Organism:Homo sapiens (Human)
Description:P35408
Residue:488
BDBM50335995
NameBDBM50335995
Synonyms:CHEMBL1669003 | N-(1-(3-methyl-4-(6-oxo-5,9-bis(2,2,2-trifluoroethoxy)-6H-pyrrolo[3,4-g]quinolin-7(8H)-yl)benzyl)cyclopropylcarbamoyl)naphthalene-2-sulfonamide
TypeSmall organic molecule
Emp. Form.C37H30F6N4O6S
Mol. Mass.772.713
SMILESCc1cc(CC2(CC2)NC(=O)NS(=O)(=O)c2ccc3ccccc3c2)ccc1N1Cc2c(C1=O)c(OCC(F)(F)F)c1cccnc1c2OCC(F)(F)F