Reaction Details
TargetProstaglandin E2 receptor EP4 subtype
LigandBDBM50336003
Substrate/Competitorn/a
Meas. Tech.ChEMBL_717059 (CHEMBL1671177)
Ki 0.32±n/a nM
Citation Burch, JDFarand, JColucci, JSturino, CDucharme, YFriesen, RWLévesque, JFGagné, SWrona, MTherien, AGMathieu, MCDenis, DVigneault, EXu, DClark, PRowland, SHan, Y Naphthalene/quinoline amides and sulfonylureas as potent and selective antagonists of the EP4 receptor. Bioorg Med Chem Lett21:1041-6 (2011) 
 
Prostaglandin E2 receptor EP4 subtype
Name:Prostaglandin E2 receptor EP4 subtype
Type:Enzyme
Mol. Mass.:53134.53
Organism:Homo sapiens (Human)
Description:P35408
Residue:488
BDBM50336003
NameBDBM50336003
Synonyms:CHEMBL1669023 | N-(4-(4,9-diethoxy-1-oxo-1H-benzo[f]isoindol-2(3H)-yl)-3-methylphenethyl)-2-(2-methoxyphenyl)acetamide
TypeSmall organic molecule
Emp. Form.C34H36N2O5
Mol. Mass.552.66
SMILESCCOc1c2CN(C(=O)c2c(OCC)c2ccccc12)c1ccc(CCNC(=O)Cc2ccccc2OC)cc1C