Reaction Details
TargetDNA-dependent protein kinase catalytic subunit
LigandBDBM50336024
Substrate/Competitorn/a
Meas. Tech.ChEMBL_717396 (CHEMBL1670118)
IC50 14±n/a nM
Citation Clapham, KMBardos, JFinlay, MRGolding, BTGriffen, EJGriffin, RJHardcastle, IRMenear, KATing, ATurner, PYoung, GLCano, C DNA-dependent protein kinase (DNA-PK) inhibitors: structure-activity relationships for O-alkoxyphenylchromen-4-one probes of the ATP-binding domain. Bioorg Med Chem Lett21:966-70 (2011) 
 
DNA-dependent protein kinase catalytic subunit
Name:DNA-dependent protein kinase catalytic subunit
Type:Protein
Mol. Mass.:469114.78
Organism:Homo sapiens (Human)
Description:P78527
Residue:4128
BDBM50336024
NameBDBM50336024
Synonyms:2-morpholino-N-(5-(2-morpholino-4-oxo-4H-chromen-8-yl)biphenyl-2-yl)acetamide | CHEMBL1669170
TypeSmall organic molecule
Emp. Form.C31H31N3O5
Mol. Mass.525.5949
SMILESO=C(CN1CCOCC1)Nc1ccc(cc1-c1ccccc1)-c1cccc2c1oc(cc2=O)N1CCOCC1