Reaction Details
TargetAcetylcholinesterase
LigandBDBM120262
Substrate/Competitorn/a
Meas. Tech.ChEMBL_718132 (CHEMBL1671585)
Ki 4800±n/a nM
Citation Musilek, KKomloova, MHolas, OHrabinova, MPohanka, MDohnal, VNachon, FDolezal, MKuca, K Preparation and in vitro screening of symmetrical bis-isoquinolinium cholinesterase inhibitors bearing various connecting linkage--implications for early Myasthenia gravis treatment. Eur J Med Chem46:811-8 (2011) 
 
Acetylcholinesterase
Name:Acetylcholinesterase
Type:Enzyme
Mol. Mass.:67792.70
Organism:Homo sapiens (Human)
Description:P22303
Residue:614
BDBM120262
NameBDBM120262
Synonyms:EDROPHONIUM BROMIDE Edrophonium cid_8307
TypeSmall organic molecule
Emp. Form.C10H16NO
Mol. Mass.166.2396
SMILESCC[N+](C)(C)c1cccc(O)c1