Reaction Details
TargetGalectin-8
LigandBDBM50336202
Substrate/Competitorn/a
Meas. Tech.ChEMBL_716456 (CHEMBL1670080)
Kd 31.3±n/a nM
Citation Murakami, TYoshioka, KSato, YTanaka, MNiwa, OYabuki, S Synthesis and galectin-binding activities of mercaptododecyl glycosides containing a terminalß-galactosyl group. Bioorg Med Chem Lett21:1265-9 (2011) 
 
Galectin-8
Name:Galectin-8
Type:PROTEIN
Mol. Mass.:35814.23
Organism:Homo sapiens (Human)
Description:ChEMBL_1454625
Residue:317
BDBM50336202
NameBDBM50336202
Synonyms:12-Mercaptododecyl-beta-D-galactopyranosyl-(1->4)-2-deoxy-alpha-D-arabino-hexopyranoside | CHEMBL1669630
TypeSmall organic molecule
Emp. Form.C24H46O10S
Mol. Mass.526.681
SMILESOC[C@H]1O[C@@H](O[C@H]2[C@H](O)C[C@@H](OCCCCCCCCCCCCS)O[C@@H]2CO)[C@H](O)[C@@H](O)[C@H]1O