Reaction Details
TargetGalectin-8
LigandBDBM50336204
Substrate/Competitorn/a
Meas. Tech.ChEMBL_716455 (CHEMBL1670079)
Kd 1.6±n/a nM
Citation Murakami, TYoshioka, KSato, YTanaka, MNiwa, OYabuki, S Synthesis and galectin-binding activities of mercaptododecyl glycosides containing a terminalß-galactosyl group. Bioorg Med Chem Lett21:1265-9 (2011) 
 
Galectin-8
Name:Galectin-8
Type:PROTEIN
Mol. Mass.:35814.23
Organism:Homo sapiens (Human)
Description:ChEMBL_1454625
Residue:317
BDBM50336204
NameBDBM50336204
Synonyms:12-Mercaptododecyl-beta-D-galactopyranosyl-(1->4)-beta-D-glucopyranoside | CHEMBL1669628
TypeSmall organic molecule
Emp. Form.C24H46O11S
Mol. Mass.542.68
SMILESOC[C@H]1OC(O[C@H]2[C@H](O)[C@@H](O)[C@H](OCCCCCCCCCCCCS)O[C@@H]2CO)[C@H](O)[C@@H](O)[C@H]1O