Reaction Details
TargetGalectin-8
LigandBDBM50336203
Substrate/Competitorn/a
Meas. Tech.ChEMBL_716455 (CHEMBL1670079)
Kd 0.233±n/a nM
Citation Murakami, TYoshioka, KSato, YTanaka, MNiwa, OYabuki, S Synthesis and galectin-binding activities of mercaptododecyl glycosides containing a terminalß-galactosyl group. Bioorg Med Chem Lett21:1265-9 (2011) 
 
Galectin-8
Name:Galectin-8
Type:PROTEIN
Mol. Mass.:35814.23
Organism:Homo sapiens (Human)
Description:ChEMBL_1454625
Residue:317
BDBM50336203
NameBDBM50336203
Synonyms:12-Mercaptododecyl-beta-D-galactopyranosyl-(1->4)-2-acetamido-2-deoxy-alpha-D-glucopyranoside | CHEMBL1669631
TypeSmall organic molecule
Emp. Form.C26H49NO11S
Mol. Mass.583.732
SMILESCC(=O)N[C@@H]1[C@@H](O)[C@H](O[C@@H]2O[C@H](CO)[C@H](O)[C@H](O)[C@H]2O)[C@@H](CO)O[C@@H]1OCCCCCCCCCCCCS