Reaction Details
TargetLactoylglutathione lyase
LigandBDBM50336259
Substrate/Competitorn/a
Meas. Tech.ChEMBL_716548 (CHEMBL1670272)
Ki 3600±n/a nM
Citation Yuan, MLuo, MSong, YXu, QWang, XCao, YBu, XRen, YHu, X Identification of curcumin derivatives as human glyoxalase I inhibitors: A combination of biological evaluation, molecular docking, 3D-QSAR and molecular dynamics simulation studies. Bioorg Med Chem19:1189-96 (2011) 
 
Lactoylglutathione lyase
Name:Lactoylglutathione lyase
Type:Enzyme
Mol. Mass.:20772.95
Organism:Homo sapiens (Human)
Description:Q04760
Residue:184
BDBM50336259
NameBDBM50336259
Synonyms:4-(5-(3,4-dimethoxyphenyl)-2-(-3-(3,4-dimethoxyphenyl)acryloyl)-3-oxopenta-1,4-dienyl)phthalaldehyde | CHEMBL1669730
TypeSmall organic molecule
Emp. Form.C32H28O8
Mol. Mass.540.5599
SMILES[#6]-[#8]-c1ccc(\[#6]=[#6]\[#6](=O)-[#6](=[#6]/c2ccc(-[#6]=O)c(-[#6]=O)c2)\[#6](=O)\[#6]=[#6]\c2ccc(-[#8]-[#6])c(-[#8]-[#6])c2)cc1-[#8]-[#6]