Reaction Details
TargetLactoylglutathione lyase
LigandBDBM50336263
Substrate/Competitorn/a
Meas. Tech.ChEMBL_716548 (CHEMBL1670272)
Ki 91000±n/a nM
Citation Yuan, MLuo, MSong, YXu, QWang, XCao, YBu, XRen, YHu, X Identification of curcumin derivatives as human glyoxalase I inhibitors: A combination of biological evaluation, molecular docking, 3D-QSAR and molecular dynamics simulation studies. Bioorg Med Chem19:1189-96 (2011) 
 
Lactoylglutathione lyase
Name:Lactoylglutathione lyase
Type:Enzyme
Mol. Mass.:20772.95
Organism:Homo sapiens (Human)
Description:Q04760
Residue:184
BDBM50336263
NameBDBM50336263
Synonyms:3-(3-nitrobenzylidene)pentane-2,4-dione | CHEMBL1669733
TypeSmall organic molecule
Emp. Form.C12H11NO4
Mol. Mass.233.22
SMILES[#6]-[#6](=O)-[#6](=[#6]\c1cccc(c1)-[#7+](-[#8-])=O)\[#6](-[#6])=O