Reaction Details
TargetLactoylglutathione lyase
LigandBDBM50336264
Substrate/Competitorn/a
Meas. Tech.ChEMBL_716548 (CHEMBL1670272)
Ki 27000±n/a nM
Citation Yuan, MLuo, MSong, YXu, QWang, XCao, YBu, XRen, YHu, X Identification of curcumin derivatives as human glyoxalase I inhibitors: A combination of biological evaluation, molecular docking, 3D-QSAR and molecular dynamics simulation studies. Bioorg Med Chem19:1189-96 (2011) 
 
Lactoylglutathione lyase
Name:Lactoylglutathione lyase
Type:Enzyme
Mol. Mass.:20772.95
Organism:Homo sapiens (Human)
Description:Q04760
Residue:184
BDBM50336264
NameBDBM50336264
Synonyms:3-((5-nitrofuran-2-yl)methylene)pentane-2,4-dione | CHEMBL1669734
TypeSmall organic molecule
Emp. Form.C10H9NO5
Mol. Mass.223.1822
SMILES[#6]-[#6](=O)-[#6](=[#6]\c1ccc(o1)-[#7+](-[#8-])=O)\[#6](-[#6])=O