Reaction Details
TargetLactoylglutathione lyase
LigandBDBM50336270
Substrate/Competitorn/a
Meas. Tech.ChEMBL_716548 (CHEMBL1670272)
Ki 1394000±n/a nM
Citation Yuan, MLuo, MSong, YXu, QWang, XCao, YBu, XRen, YHu, X Identification of curcumin derivatives as human glyoxalase I inhibitors: A combination of biological evaluation, molecular docking, 3D-QSAR and molecular dynamics simulation studies. Bioorg Med Chem19:1189-96 (2011) 
 
Lactoylglutathione lyase
Name:Lactoylglutathione lyase
Type:Enzyme
Mol. Mass.:20772.95
Organism:Homo sapiens (Human)
Description:Q04760
Residue:184
BDBM50336270
NameBDBM50336270
Synonyms:3-(4-fluorophenyl)acrylamide | CHEMBL1669739
TypeSmall organic molecule
Emp. Form.C9H8FNO
Mol. Mass.165.1643
SMILESNC(=O)\C=C\c1ccc(F)cc1