Reaction Details
TargetLactoylglutathione lyase
LigandBDBM54705
Substrate/Competitorn/a
Meas. Tech.ChEMBL_716548 (CHEMBL1670272)
Ki 383000±n/a nM
Citation Yuan, MLuo, MSong, YXu, QWang, XCao, YBu, XRen, YHu, X Identification of curcumin derivatives as human glyoxalase I inhibitors: A combination of biological evaluation, molecular docking, 3D-QSAR and molecular dynamics simulation studies. Bioorg Med Chem19:1189-96 (2011) 
 
Lactoylglutathione lyase
Name:Lactoylglutathione lyase
Type:Enzyme
Mol. Mass.:20772.95
Organism:Homo sapiens (Human)
Description:Q04760
Residue:184
BDBM54705
NameBDBM54705
Synonyms:CHEMBL1297 UNM-0000306101 calcium;2-(3-phenoxyphenyl)propionic acid;hydrate | cid_16219353
TypeSmall organic molecule
Emp. Form.C15H14O3
Mol. Mass.242.2699
SMILESCC(C(O)=O)c1cccc(Oc2ccccc2)c1