Reaction Details
TargetMineralocorticoid receptor
LigandBDBM50336279
Substrate/Competitorn/a
Meas. Tech.ChEMBL_716553 (CHEMBL1670277)
IC50 6510±n/a nM
Citation Jiang, CSZhou, RGong, JXChen, LLKurtán, TShen, XGuo, YW Synthesis, modification, and evaluation of (R)-de-O-methyllasiodiplodin and analogs as nonsteroidal antagonists of mineralocorticoid receptor. Bioorg Med Chem Lett21:1171-5 (2011) 
 
Mineralocorticoid receptor
Name:Mineralocorticoid receptor
Type:Enzyme Catalytic Domain
Mol. Mass.:106748.15
Organism:RAT
Description:mineralocorticoid 0 RAT::P22199
Residue:981
BDBM50336279
NameBDBM50336279
Synonyms:(R)-3-methyl-1-oxo-3,4,5,6,7,8,9,10-octahydro-1H-benzo[c][1]oxacyclododecine-12,14-diyl bis(4-methylbenzenesulfonate) | CHEMBL1669768
TypeSmall organic molecule
Emp. Form.C30H34O8S2
Mol. Mass.586.716
SMILESC[C@@H]1CCCCCCCc2cc(OS(=O)(=O)c3ccc(C)cc3)cc(OS(=O)(=O)c3ccc(C)cc3)c2C(=O)O1