Reaction Details
TargetInsulin-like growth factor 1 receptor
LigandBDBM50336316
Substrate/Competitorn/a
Meas. Tech.ChEMBL_716595 (CHEMBL1670374)
IC50 20±n/a nM
Citation Jin, MKleinberg, ACooke, AGokhale, PCForeman, KDong, HSiu, KWBittner, MAMulvihill, KMYao, YLandfair, DO'Connor, MMak, GPachter, JAWild, RRosenfeld-Franklin, MJi, QMulvihill, MJ Potent and selective cyclohexyl-derived imidazopyrazine insulin-like growth factor 1 receptor inhibitors with in vivo efficacy. Bioorg Med Chem Lett21:1176-80 (2011) 
 
Insulin-like growth factor 1 receptor
Name:Insulin-like growth factor 1 receptor
Type:Protein
Mol. Mass.:154776.79
Organism:Homo sapiens (Human)
Description:P08069
Residue:1367
BDBM50336316
NameBDBM50336316
Synonyms:CHEMBL410659 cis-3-(3-azetidin-1-ylmethylcyclobutyl)-1-(2-phenylquinolin-7-yl)imidazo[1,5-a]pyrazin-8-ylamine
TypeSmall organic molecule
Emp. Form.C29H28N6
Mol. Mass.460.5728
SMILESNc1nccn2c(nc(-c3ccc4ccc(nc4c3)-c3ccccc3)c12)[C@@H]1C[C@H](CN2CCC2)C1