Reaction Details
TargetInsulin-like growth factor 1 receptor
LigandBDBM50336322
Substrate/Competitorn/a
Meas. Tech.ChEMBL_716595 (CHEMBL1670374)
IC50 6±n/a nM
Citation Jin, MKleinberg, ACooke, AGokhale, PCForeman, KDong, HSiu, KWBittner, MAMulvihill, KMYao, YLandfair, DO'Connor, MMak, GPachter, JAWild, RRosenfeld-Franklin, MJi, QMulvihill, MJ Potent and selective cyclohexyl-derived imidazopyrazine insulin-like growth factor 1 receptor inhibitors with in vivo efficacy. Bioorg Med Chem Lett21:1176-80 (2011) 
 
Insulin-like growth factor 1 receptor
Name:Insulin-like growth factor 1 receptor
Type:Protein
Mol. Mass.:154776.79
Organism:Homo sapiens (Human)
Description:P08069
Residue:1367
BDBM50336322
NameBDBM50336322
Synonyms:CHEMBL1667940 | trans-4-(8-amino-1-(8-fluoro-2-phenylquinolin-7-yl)imidazo[1,5-a]pyrazin-3-yl)cyclohexanecarboxamide
TypeSmall organic molecule
Emp. Form.C28H25FN6O
Mol. Mass.480.5361
SMILESNC(=O)[C@H]1CC[C@@H](CC1)c1nc(-c2ccc3ccc(nc3c2F)-c2ccccc2)c2c(N)nccn12