Reaction Details
TargetInsulin-like growth factor 1 receptor
LigandBDBM50336331
Substrate/Competitorn/a
Meas. Tech.ChEMBL_716595 (CHEMBL1670374)
IC50 14±n/a nM
Citation Jin, MKleinberg, ACooke, AGokhale, PCForeman, KDong, HSiu, KWBittner, MAMulvihill, KMYao, YLandfair, DO'Connor, MMak, GPachter, JAWild, RRosenfeld-Franklin, MJi, QMulvihill, MJ Potent and selective cyclohexyl-derived imidazopyrazine insulin-like growth factor 1 receptor inhibitors with in vivo efficacy. Bioorg Med Chem Lett21:1176-80 (2011) 
 
Insulin-like growth factor 1 receptor
Name:Insulin-like growth factor 1 receptor
Type:Protein
Mol. Mass.:154776.79
Organism:Homo sapiens (Human)
Description:P08069
Residue:1367
BDBM50336331
NameBDBM50336331
Synonyms:CHEMBL1667950 | trans-4-(8-amino-1-(8-fluoro-2-phenylquinolin-7-yl)imidazo[1,5-a]pyrazin-3-yl)-N-(1-methyl-1H-benzo[d]imidazol-2-yl)cyclohexanecarboxamide
TypeSmall organic molecule
Emp. Form.C36H31FN8O
Mol. Mass.610.6827
SMILESCn1c(NC(=O)[C@H]2CC[C@@H](CC2)c2nc(-c3ccc4ccc(nc4c3F)-c3ccccc3)c3c(N)nccn23)nc2ccccc12