Reaction Details
TargetHistone deacetylase 6
LigandBDBM50336342
Substrate/Competitorn/a
Meas. Tech.ChEMBL_716694 (CHEMBL1670519)
IC50 800±n/a nM
Citation Choi, ELee, CPark, JESeo, JJCho, MKang, JSKim, HMPark, SKLee, KHan, G Structure and property based design, synthesis and biological evaluation of¿-lactam based HDAC inhibitors. Bioorg Med Chem Lett21:1218-21 (2011) 
 
Histone deacetylase 6
Name:Histone deacetylase 6
Type:Chromatin regulator; hydrolase; repressor
Mol. Mass.:131381.51
Organism:Homo sapiens (Human)
Description:Q9UBN7
Residue:1215
BDBM50336342
NameBDBM50336342
Synonyms:CHEMBL1668018 | N-hydroxy-3-(1-(3-(naphthalen-2-yl)propyl)-2-oxo-2,5-dihydro-1H-pyrrol-3-yl)propanamide
TypeSmall organic molecule
Emp. Form.C20H22N2O3
Mol. Mass.338.4003
SMILESONC(=O)CCC1=CCN(CCCc2ccc3ccccc3c2)C1=O